I'm attempting to compile x5250 on an ARM machine (MK802 actually) and I'm
running into a bit of a problem and wondered if anybody might have an idea.

I've already installed and compiled tn5250 0.17.4, so it's confusing to me
that I'd be getting this:

x5250term.c: In function ‘x5250_terminal_waitevent’:
x5250term.c:1955:40: error: ‘Tn5250Display’ has no member named
‘destructive_backspace’
x5250term.c:1976:8: warning: passing argument 1 of
‘XRefreshKeyboardMapping’ from incompatible pointer type [enabled by
default]
/usr/include/X11/Xlib.h:3075:12: note: expected ‘struct XMappingEvent *’
but argument is of type ‘union XEvent *’
make[2]: *** [x5250term.o] Error 1
make[2]: Leaving directory `/tmp/x5250/x5250-0.5.3/src'
make[1]: *** [all-recursive] Error 1
make[1]: Leaving directory `/tmp/x5250/x5250-0.5.3'
make: *** [all] Error 2


Any ideas?

As an Amazon Associate we earn from qualifying purchases.

This thread ...

Follow-Ups:

Follow On AppleNews
Return to Archive home page | Return to MIDRANGE.COM home page

This mailing list archive is Copyright 1997-2021 by midrange.com and David Gibbs as a compilation work. Use of the archive is restricted to research of a business or technical nature. Any other uses are prohibited. Full details are available on our policy page. If you have questions about this, please contact [javascript protected email address].

Operating expenses for this site are earned using the Amazon Associate program and Google Adsense.